{"text_format":"1","workbook":"xlsx","n_sheets":10,"sheets":["Data","Innledning","Kartlegging","Kartlegging resultater","Prioritering del 1","Prioritering del 2","Handlingsplan","Utvikling del 1","Utvikling del 2-1","Utvikling del 2"],"not_rendered":{"charts":7,"images":0,"macros":1,"external_links":0,"defined_names":0,"comments":1,"pivot_tables":1},"unopened":[],"bounds":{"document_bytes":16777216,"sheet_cells":100000,"rows_first":2000,"rows_last":500,"rows_between":2000,"halvings":0,"cell_chars":16384,"cell_head_chars":4096},"cells_cut":0,"cells_raw":0,"read":"whole","date_system":"1900"}

{"sheet":"Data","index":0,"n_rows":87,"n_cols":13,"rows_kept":87,"cut":false,"hidden":true,"merged":[]}
["Nivå",null,null,null,"Viktighet",null,"Nivå","Poeng nivå","Prioritet ift. rekkefølge","Poeng Prioritet ift. rekkefølge","Score","Navn","Prioritet"]
["Nivå 1",1,null,null,"Lav",null,"Nivå 1",4,"Lav",1,{"$f":"H2*J2","v":4},{"$f":"G2&I2","v":"Nivå 1Lav"},{"$f":"VLOOKUP(K2,$G$17:$H$28,2,FALSE)","v":"Lav"}]
["Nivå 2",2,null,null,"Middels",null,"Nivå 1",4,"Middels",2,{"$f":"H3*J3","v":8},{"$f":"G3&I3","v":"Nivå 1Middels"},{"$f":"VLOOKUP(K3,$G$17:$H$28,2,FALSE)","v":"Middels"}]
["Nivå 3",3,null,null,"Høy",null,"Nivå 1",4,"Høy",3,12,"Nivå 1Høy",{"$f":"VLOOKUP(K4,$G$17:$H$28,2,FALSE)","v":"Høy"}]
["Nivå 4",4,null,null,null,null,"Nivå 2",3,"Lav",1,3,"Nivå 2Lav","Lav"]
[null,null,null,null,null,null,"Nivå 2",3,"Middels",2,6,"Nivå 2Middels",{"$f":"VLOOKUP(K6,$G$17:$H$28,2,FALSE)","v":"Middels"}]
[null,null,null,null,null,null,"Nivå 2",3,"Høy",3,9,"Nivå 2Høy","Høy"]
["HOLDNINGER OG FORSTÅELSE (MINDSET)","NIVÅ","SCORE",null,null,null,"Nivå 3",2,"Lav",1,2,"Nivå 3Lav","Lav"]
[{"$f":"Kartlegging!B3","v":"Skoleeiers holdninger og forståelse"},{"$f":"VLOOKUP(A9,Kartlegging!$B$3:$G$10,6,FALSE)","v":"Nivå 3"},{"$f":"VLOOKUP(B9,$A$2:$B$5,2,FALSE)","v":3},null,null,null,"Nivå 3",2,"Middels",2,4,"Nivå 3Middels","Lav"]
[{"$f":"Kartlegging!B4","v":"Skolelederes holdninger og forståelse"},{"$f":"VLOOKUP(A10,Kartlegging!$B$3:$G$10,6,FALSE)","v":"Nivå 3"},3,null,null,null,"Nivå 3",2,"Høy",3,6,"Nivå 3Høy","Middels"]
{"$rows_left_out":78}
{"sheet":"Innledning","index":1,"n_rows":31,"n_cols":2,"rows_kept":31,"cut":false,"hidden":false,"merged":[[1,0,1,1],[8,0,8,1],[6,0,6,1],[7,0,7,1],[24,0,24,1],[25,0,25,1],[9,0,9,1],[10,0,10,1],[11,0,11,1],[12,0,12,1],[30,0,30,1],[27,0,27,1],[28,0,28,1],[29,0,29,1],[13,0,13,1],[14,0,14,1],[16,0,16,1],[17,0,17,1],[20,0,20,1],[18,0,18,1],[19,0,19,1],[21,0,21,1],[22,0,22,1],[23,0,23,1],[26,0,26,1],[15,0,15,1]]}
["Kartlegging av arbeidet med personvern og informasjonssikkerhet"]
["NB! Kun felter merket med gul farge skal fylles ut. Resten fylles ut automatisk."]
["Kommune:","[Sett inn kommune]"]
["Kontaktperson:","[Sett inn fullt navn]"]
["Kontaktperson epost:","[Sett inn epost]"]
[]
["Formålet med kartleggingen"]
["Formålet med kartleggingen er å få oversikt over dagens arbeid med personvern og informasjonssikkerhet i oppvekstsektoren i egen kommune. Kartleggingen danner grunnlag for å prioritere videre arbeid på området."]
["Hvem kartlegger?"]
["Kartleggingsverktøyet fylles ut av rådgiver som har blitt delegert ansvaret for vurdering av personvern og sikkerhet i digitale læringsressurser i skolen. Kartleggingen gjøres basert på rådgivers egen vurdering av oppvekstområdet i kommunen som helhet. Dette vil ikke gi et eksakt bilde, men vil fungere som et grunnlag for diskusjon og samtale rundt kommunens ståsted og prioritering av videre arbeid. Involver andre ressurspersoner etter behov."]
{"$rows_left_out":22}
{"sheet":"Kartlegging","index":2,"n_rows":37,"n_cols":8,"rows_kept":37,"cut":false,"hidden":false,"merged":[]}
["Nr.","Område","Nivå 1","Nivå 2","Nivå 3","Nivå 4","Egenvurdering","Begrunnelse for nivåplassering"]
[null,"HOLDNINGER OG FORSTÅELSE (MINDSET)"]
[1,"Skoleeiers holdninger og forståelse","Skoleeier (kommunen) er usikker på ha slags ansvar man har som behandlingsansvarlig.","Skoleeier (kommunen) er klar over at man har behandlingsansvar, men pliktene er delegert til andre ansatte som følger det opp uten skoleeiers involvering.","Skoleeier (kommunen) er klar over sitt behandlingsansvar i kommunen. Pliktene er delegert til andre ansatte, og skoleeier får jevnlig oppdateringer fra personvernombud og lignende i saker som angår skoleeier. ","Skoleeier (kommunen) er klar over sitt behandlingsansvar. Pliktene er delegert til andre ansatte, og skoleeier får jevnlig oppdateringer fra personvernombud og lignende i saker som angår skoleeier. Skoleeier mottar jevnlige rapporter på skolesektorens tilstand og bruker dette i beslutningsprosesser.","Nivå 3","[Skriv begrunnelse]"]
[2,"Skolelederes holdninger og forståelse","Skoleledere er usikre på hva slags ansvar man har som behandlingsansvarlig i kommunen.","Skoleledere er klar over at man har behandlingsansvar, men pliktene er delegert til lærere og andre ansatte som følger det opp uten skolelederes involvering.","Skoleledere er klar over sitt behandlingsansvar og har fått god lederopplæring innen personvern og informasjonssikkerhet. Skoleledere er i stand til å ta enkle personvern og informasjonssikkerhetsvurderinger selv, men forstår samtidig sine begrensninger på området.","Skoleledere er klar over sitt behandlingsansvar. Skoleleder vet hvordan de kan ta vare på lærernes og elevenes personvern og informasjonssikkerhet i skolehverdagen. Skoleledere vet hvor de kan henvende seg dersom de trenger ytterligere rådgivning innen personvern og informasjonssikkerhet.","Nivå 3","[Skriv begrunnelse]"]
[3,"Lærernes holdninger og forståelse","Lærere er usikre på sin rolle i ivaretakelsen av elevenes personvern og hva det innebærer.","Lærere er klar over sin rolle i ivaretakelsen av elevenes personvern, men er usikker på om de har nok kompetanse til å ta selvstendige avgjørelser med tanke på elevenes personvern.","Lærere er klar over sin rolle i ivaretakelsen av elevenes personvern og har fått opplæring i personvern og informasjonssikkerhet. Lærer er i stand til å ta enkle personvern og informasjonssikkerhetsvurderinger selv, men forstår samtidig sine begrensninger på området.","Lærere er klar over sin rolle i ivaretakelsen av elevenes personvern og vet hvordan de kan ta vare på elevers personvern og informasjonssikkerhet i skolehverdagen. Lærere vet hvor de kan henvende seg dersom de trenger ytterligere informasjon/hjelp i personvernspørsmål.","Nivå 3","[Skriv begrunnelse]"]
[4,"Foresattes holdninger og forståelse","Foresatte kan lite om personopplysninger og hva de kan brukes til.","Foresatte kan litt om personopplysninger og hva de kan brukes til, men er usikker på om de har nok kompetanse til å ta selvstendige avgjørelser med tanke på elevenes personvern.","Foresatte vet hva personopplysninger er og hva de kan brukes til. Foresatte er i stand til å ta enkle personvern og informasjonssikkerhetsvurderinger selv, men forstår samtidig sine begrensninger på området.","Foresatte vet hva personopplysninger er, hva de kan brukes til og at slike opplysninger må beskyttes mot ulovlig bruk. Foresatte vet hvor de kan henvende seg dersom de trenger ytterligere informasjon/hjelp i personvernspørsmål.","Nivå 2","[Skriv begrunnelse]"]
[5,"Elevers holdninger og forståelse","Elevene kan lite om digital trygghet og hva personopplysninger kan brukes til (f.eks. profilering).","Elevene kan litt om digital trygghet og hva  personopplysninger kan brukes til (f.eks. profilering), men er usikker på om de har nok kompetanse til å ta selvstendige avgjørelser med tanke på sitt personvern.","Elevene vet hva digital trygghet er og hva personopplysninger kan brukes til (f.eks. profilering). Elevene er i stand til å ta enkle personvern og informasjonssikkerhetsvurderinger selv, men forstår samtidig sine begrensninger på området.","Elevene vet hva digital trygghet er, og hva personopplysninger kan brukes til (f.eks. profilering) og at slike opplysninger må beskyttes mot ulovlig bruk. Elevene vet hvor de kan henvende seg dersom de trenger ytterligere informasjon/hjelp i personvernspørsmål.","Nivå 1","[Skriv begrunnelse]"]
[6,"Etterlevelse av retningslinjer","Nye retningslinjer blir sett på som et inngripen i skolehverdagen som opprettes for å gjøre livet vanskeligere for ansatte i skolen. Retningslinjene møtes med motstand. ","Nye retningslinjer blir sett på som noe ubeleilig og blir møtt med skepsis og noe motstand. Retningslinjene etterleves av noen.","Nye retningslinjer blir sett på med nysgjerrighet og konstruktiv skepsis. De fleste lar seg overtale ved tilgang til god informasjon. Retningslinjene etterleves av stort sett de fleste. ","Nye retningslinjer oppleves som nødvendlige for å ta tilstrekkelig vare på læreres og elevers personvern. Alle etterlever retningslinjene etter at de har fått god informasjon om bakgrunnen for at de er innført. ","Nivå 1","[Skriv begrunnelse]"]
[7,"Innføring av nye retningslinjer - eksempelvis: Ikke lov med felles passord i småskolen.","Kommunen/IT-tjenesten innfører nye retningslinjer plutselig og uten involvering av de ansatte i skolen. Retningslinjene oppleves som \"begrensning av frihet\" og at kommunen ikke har \"tillit til skolene\". Ansatte i skolen ønsker omkamp.","Kommunen/IT-tjenesten innfører nye retningslinjer med noe begrunnelse, de ansatte i skolen har ikke vært involvert i prosessen og sliter med å forstå begrunnelsen og derav behovet for de nye retningslinjene. Enkelte ansatte i skolen ber om tilbakeføring til gammel praksis. ","Kommunen/IT-tjenesten innfører nye retningslinjer etter noe dialog med ansatte i skolen. Retningslinjene har blitt innført med god informasjon, men skoleledere er litt usikre på begrunnelsen for hvorfor retningslinjene er nødvendlige.","Kommunen/IT-tjenesten innfører nye retningslinjer i samarbeid med skoleledelsen. Ansatte i skolen har vært involvert i sikkerhetsvurderingene som ligger bak de nye retningslinjene og skolelederene er i stand til å gi de ansatte i skolen en god begrunnelse for tiltaket.","Nivå 3","[Skriv begrunnelse]"]
[8,"Skolene som del av kommunen som helhet","Sentral kommuneadministrasjon er i liten grad involvert i skolene sitt arbeid med personvern og informasjonssikkerhet. ","Sentral kommuneadministrasjon har forventning til at skolene følger opp personvern og informasjonssikkerhet, men bidrar i mindre grad i gjennomføring av eksempelvis risiko- og sårbarhetsanalyser (ROS) og vurderinger av personvernkonsekvenser (DPIA).","Sentral kommuneadministrasjon har ansvaret for og samarbeider i noen grad med skolene i deres arbeid med personvern og informasjonssikkerhet, og kan stille med ekspertise ved behov.","Sentral kommuneadministrasjon har ansvaret for og samarbeider aktivt med skolene i deres arbeid med personvern og informasjonssikkerhet.","Nivå 1","[Skriv begrunnelse]"]
{"$rows_left_out":28}
{"sheet":"Kartlegging resultater","index":3,"n_rows":0,"n_cols":0,"rows_kept":0,"cut":false,"hidden":false,"merged":[]}

{"sheet":"Prioritering del 1","index":4,"n_rows":36,"n_cols":8,"rows_kept":36,"cut":false,"hidden":false,"merged":[]}
[null,"Prioritering av tiltak"]
[]
["#","Område","Kategori","Egenvurdering","Beskrivelse","Begrunnelse","SkoleSecs anbefaling","Forslag til prioriteringer"]
[1,{"$f":"Kartlegging!B3","v":"Skoleeiers holdninger og forståelse"},"Holdninger og forståelse (Mindset)",{"$f":"Kartlegging!G3","v":"Nivå 3"},{"$f":"IF(D4=\"Nivå 1\",Kartlegging!C3,IF(D4=\"Nivå 2\",Kartlegging!D3,IF(D4=\"Nivå 3\",Kartlegging!E3,IF(D4=\"Nivå 4\",Kartlegging!F3,\"\"))))","v":"Skoleeier (kommunen) er klar over sitt behandlingsansvar i kommunen. Pliktene er delegert til andre ansatte, og skoleeier får jevnlig oppdateringer fra personvernombud og lignende i saker som angår skoleeier. "},{"$f":"Kartlegging!H3","v":"[Skriv begrunnelse]"},"Høy",{"$f":"VLOOKUP(D4&G4,Data!$L$2:$M$13,2,FALSE)","v":"Middels"}]
[2,{"$f":"Kartlegging!B4","v":"Skolelederes holdninger og forståelse"},"Holdninger og forståelse (Mindset)",{"$f":"Kartlegging!G4","v":"Nivå 3"},{"$f":"IF(D5=\"Nivå 1\",Kartlegging!C4,IF(D5=\"Nivå 2\",Kartlegging!D4,IF(D5=\"Nivå 3\",Kartlegging!E4,IF(D5=\"Nivå 4\",Kartlegging!F4,\"\"))))","v":"Skoleledere er klar over sitt behandlingsansvar og har fått god lederopplæring innen personvern og informasjonssikkerhet. Skoleledere er i stand til å ta enkle personvern og informasjonssikkerhetsvurderinger selv, men forstår samtidig sine begrensninger på området."},{"$f":"Kartlegging!H4","v":"[Skriv begrunnelse]"},"Høy",{"$f":"VLOOKUP(D5&G5,Data!$L$2:$M$13,2,FALSE)","v":"Middels"}]
[3,{"$f":"Kartlegging!B5","v":"Lærernes holdninger og forståelse"},"Holdninger og forståelse (Mindset)",{"$f":"Kartlegging!G5","v":"Nivå 3"},{"$f":"IF(D6=\"Nivå 1\",Kartlegging!C5,IF(D6=\"Nivå 2\",Kartlegging!D5,IF(D6=\"Nivå 3\",Kartlegging!E5,IF(D6=\"Nivå 4\",Kartlegging!F5,\"\"))))","v":"Lærere er klar over sin rolle i ivaretakelsen av elevenes personvern og har fått opplæring i personvern og informasjonssikkerhet. Lærer er i stand til å ta enkle personvern og informasjonssikkerhetsvurderinger selv, men forstår samtidig sine begrensninger på området."},{"$f":"Kartlegging!H5","v":"[Skriv begrunnelse]"},"Middels",{"$f":"VLOOKUP(D6&G6,Data!$L$2:$M$13,2,FALSE)","v":"Lav"}]
[4,{"$f":"Kartlegging!B6","v":"Foresattes holdninger og forståelse"},"Holdninger og forståelse (Mindset)",{"$f":"Kartlegging!G6","v":"Nivå 2"},{"$f":"IF(D7=\"Nivå 1\",Kartlegging!C6,IF(D7=\"Nivå 2\",Kartlegging!D6,IF(D7=\"Nivå 3\",Kartlegging!E6,IF(D7=\"Nivå 4\",Kartlegging!F6,\"\"))))","v":"Foresatte kan litt om personopplysninger og hva de kan brukes til, men er usikker på om de har nok kompetanse til å ta selvstendige avgjørelser med tanke på elevenes personvern."},{"$f":"Kartlegging!H6","v":"[Skriv begrunnelse]"},"Lav",{"$f":"VLOOKUP(D7&G7,Data!$L$2:$M$13,2,FALSE)","v":"Lav"}]
[5,{"$f":"Kartlegging!B7","v":"Elevers holdninger og forståelse"},"Holdninger og forståelse (Mindset)",{"$f":"Kartlegging!G7","v":"Nivå 1"},{"$f":"IF(D8=\"Nivå 1\",Kartlegging!C7,IF(D8=\"Nivå 2\",Kartlegging!D7,IF(D8=\"Nivå 3\",Kartlegging!E7,IF(D8=\"Nivå 4\",Kartlegging!F7,\"\"))))","v":"Elevene kan lite om digital trygghet og hva personopplysninger kan brukes til (f.eks. profilering)."},{"$f":"Kartlegging!H7","v":"[Skriv begrunnelse]"},"Lav",{"$f":"VLOOKUP(D8&G8,Data!$L$2:$M$13,2,FALSE)","v":"Lav"}]
[6,{"$f":"Kartlegging!B8","v":"Etterlevelse av retningslinjer"},"Holdninger og forståelse (Mindset)",{"$f":"Kartlegging!G8","v":"Nivå 1"},{"$f":"IF(D9=\"Nivå 1\",Kartlegging!C8,IF(D9=\"Nivå 2\",Kartlegging!D8,IF(D9=\"Nivå 3\",Kartlegging!E8,IF(D9=\"Nivå 4\",Kartlegging!F8,\"\"))))","v":"Nye retningslinjer blir sett på som et inngripen i skolehverdagen som opprettes for å gjøre livet vanskeligere for ansatte i skolen. Retningslinjene møtes med motstand. "},{"$f":"Kartlegging!H8","v":"[Skriv begrunnelse]"},"Middels",{"$f":"VLOOKUP(D9&G9,Data!$L$2:$M$13,2,FALSE)","v":"Middels"}]
[7,{"$f":"Kartlegging!B9","v":"Innføring av nye retningslinjer - eksempelvis: Ikke lov med felles passord i småskolen."},"Holdninger og forståelse (Mindset)",{"$f":"Kartlegging!G9","v":"Nivå 3"},{"$f":"IF(D10=\"Nivå 1\",Kartlegging!C9,IF(D10=\"Nivå 2\",Kartlegging!D9,IF(D10=\"Nivå 3\",Kartlegging!E9,IF(D10=\"Nivå 4\",Kartlegging!F9,\"\"))))","v":"Kommunen/IT-tjenesten innfører nye retningslinjer etter noe dialog med ansatte i skolen. Retningslinjene har blitt innført med god informasjon, men skoleledere er litt usikre på begrunnelsen for hvorfor retningslinjene er nødvendlige."},{"$f":"Kartlegging!H9","v":"[Skriv begrunnelse]"},"Middels",{"$f":"VLOOKUP(D10&G10,Data!$L$2:$M$13,2,FALSE)","v":"Lav"}]
{"$rows_left_out":27}
{"sheet":"Prioritering del 2","index":5,"n_rows":6,"n_cols":5,"rows_kept":6,"cut":false,"hidden":false,"merged":[]}
["Antall av Forslag til prioriteringer","Kolonneetiketter"]
["Radetiketter","Høy","Middels","Lav","Totalsum"]
["Holdninger og forståelse (Mindset)",1,3,4,8]
["Kunnskap og ferdigheter (Skills)",6,3,5,14]
["Redskaper (Tools)",4,5,2,11]
["Totalsum",11,11,11,33]

{"sheet":"Handlingsplan","index":6,"n_rows":21,"n_cols":8,"rows_kept":21,"cut":false,"hidden":false,"merged":[[3,0,3,7],[9,0,9,7],[15,0,15,7]]}
["Handlingsplan"]
[]
["Område","Baseline nivå","Beskrivelse baseline","Mål nivå","Beskrivelse mål","Tiltak","Frist","Ansvar"]
["HOLDNINGER OG FORSTÅELSE (MINDSET)"]
["Skoleeiers holdninger og forståelse",{"$f":"IF(ISBLANK(A5),\"\",VLOOKUP(A5,Kartlegging!$B$3:$H$37,6,FALSE))","v":"Nivå 3"},{"$f":"IF(B5=\"Nivå 1\",VLOOKUP(A5,Kartlegging!$B$3:$H$37,2,FALSE),IF(B5=\"Nivå 2\",VLOOKUP(A5,Kartlegging!$B$3:$H$37,3,FALSE),IF(B5=\"Nivå 3\",VLOOKUP(A5,Kartlegging!$B$3:$H$37,4,FALSE),IF(B5=\"Nivå 4\",VLOOKUP(A5,Kartlegging!$B$3:$H$37,5,FALSE),\"\"))))","v":"Skoleeier (kommunen) er klar over sitt behandlingsansvar i kommunen. Pliktene er delegert til andre ansatte, og skoleeier får jevnlig oppdateringer fra personvernombud og lignende i saker som angår skoleeier. "},"Nivå 4",{"$f":"IF(D5=\"Nivå 1\",VLOOKUP(A5,Kartlegging!$B$3:$H$37,2,FALSE),IF(D5=\"Nivå 2\",VLOOKUP(A5,Kartlegging!$B$3:$H$37,3,FALSE),IF(D5=\"Nivå 3\",VLOOKUP(A5,Kartlegging!$B$3:$H$37,4,FALSE),IF(D5=\"Nivå 4\",VLOOKUP(A5,Kartlegging!$B$3:$H$37,5,FALSE),\"\"))))","v":"Skoleeier (kommunen) er klar over sitt behandlingsansvar. Pliktene er delegert til andre ansatte, og skoleeier får jevnlig oppdateringer fra personvernombud og lignende i saker som angår skoleeier. Skoleeier mottar jevnlige rapporter på skolesektorens tilstand og bruker dette i beslutningsprosesser."}]
["Elevers holdninger og forståelse",{"$f":"IF(ISBLANK(A6),\"\",VLOOKUP(A6,Kartlegging!$B$3:$H$37,6,FALSE))","v":"Nivå 1"},{"$f":"IF(B6=\"Nivå 1\",VLOOKUP(A6,Kartlegging!$B$3:$H$37,2,FALSE),IF(B6=\"Nivå 2\",VLOOKUP(A6,Kartlegging!$B$3:$H$37,3,FALSE),IF(B6=\"Nivå 3\",VLOOKUP(A6,Kartlegging!$B$3:$H$37,4,FALSE),IF(B6=\"Nivå 4\",VLOOKUP(A6,Kartlegging!$B$3:$H$37,5,FALSE),\"\"))))","v":"Elevene kan lite om digital trygghet og hva personopplysninger kan brukes til (f.eks. profilering)."},null,{"$f":"IF(D6=\"Nivå 1\",VLOOKUP(A6,Kartlegging!$B$3:$H$37,2,FALSE),IF(D6=\"Nivå 2\",VLOOKUP(A6,Kartlegging!$B$3:$H$37,3,FALSE),IF(D6=\"Nivå 3\",VLOOKUP(A6,Kartlegging!$B$3:$H$37,4,FALSE),IF(D6=\"Nivå 4\",VLOOKUP(A6,Kartlegging!$B$3:$H$37,5,FALSE),\"\"))))","v":""}]
["Etterlevelse av retningslinjer",{"$f":"IF(ISBLANK(A7),\"\",VLOOKUP(A7,Kartlegging!$B$3:$H$37,6,FALSE))","v":"Nivå 1"},{"$f":"IF(B7=\"Nivå 1\",VLOOKUP(A7,Kartlegging!$B$3:$H$37,2,FALSE),IF(B7=\"Nivå 2\",VLOOKUP(A7,Kartlegging!$B$3:$H$37,3,FALSE),IF(B7=\"Nivå 3\",VLOOKUP(A7,Kartlegging!$B$3:$H$37,4,FALSE),IF(B7=\"Nivå 4\",VLOOKUP(A7,Kartlegging!$B$3:$H$37,5,FALSE),\"\"))))","v":"Nye retningslinjer blir sett på som et inngripen i skolehverdagen som opprettes for å gjøre livet vanskeligere for ansatte i skolen. Retningslinjene møtes med motstand. "},null,{"$f":"IF(D7=\"Nivå 1\",VLOOKUP(A7,Kartlegging!$B$3:$H$37,2,FALSE),IF(D7=\"Nivå 2\",VLOOKUP(A7,Kartlegging!$B$3:$H$37,3,FALSE),IF(D7=\"Nivå 3\",VLOOKUP(A7,Kartlegging!$B$3:$H$37,4,FALSE),IF(D7=\"Nivå 4\",VLOOKUP(A7,Kartlegging!$B$3:$H$37,5,FALSE),\"\"))))","v":""}]
["Foresattes holdninger og forståelse",{"$f":"IF(ISBLANK(A8),\"\",VLOOKUP(A8,Kartlegging!$B$3:$H$37,6,FALSE))","v":"Nivå 2"},{"$f":"IF(B8=\"Nivå 1\",VLOOKUP(A8,Kartlegging!$B$3:$H$37,2,FALSE),IF(B8=\"Nivå 2\",VLOOKUP(A8,Kartlegging!$B$3:$H$37,3,FALSE),IF(B8=\"Nivå 3\",VLOOKUP(A8,Kartlegging!$B$3:$H$37,4,FALSE),IF(B8=\"Nivå 4\",VLOOKUP(A8,Kartlegging!$B$3:$H$37,5,FALSE),\"\"))))","v":"Foresatte kan litt om personopplysninger og hva de kan brukes til, men er usikker på om de har nok kompetanse til å ta selvstendige avgjørelser med tanke på elevenes personvern."},"Nivå 4",{"$f":"IF(D8=\"Nivå 1\",VLOOKUP(A8,Kartlegging!$B$3:$H$37,2,FALSE),IF(D8=\"Nivå 2\",VLOOKUP(A8,Kartlegging!$B$3:$H$37,3,FALSE),IF(D8=\"Nivå 3\",VLOOKUP(A8,Kartlegging!$B$3:$H$37,4,FALSE),IF(D8=\"Nivå 4\",VLOOKUP(A8,Kartlegging!$B$3:$H$37,5,FALSE),\"\"))))","v":"Foresatte vet hva personopplysninger er, hva de kan brukes til og at slike opplysninger må beskyttes mot ulovlig bruk. Foresatte vet hvor de kan henvende seg dersom de trenger ytterligere informasjon/hjelp i personvernspørsmål."}]
[null,{"$f":"IF(ISBLANK(A9),\"\",VLOOKUP(A9,Kartlegging!$B$3:$H$37,6,FALSE))","v":""},{"$f":"IF(B9=\"Nivå 1\",VLOOKUP(A9,Kartlegging!$B$3:$H$37,2,FALSE),IF(B9=\"Nivå 2\",VLOOKUP(A9,Kartlegging!$B$3:$H$37,3,FALSE),IF(B9=\"Nivå 3\",VLOOKUP(A9,Kartlegging!$B$3:$H$37,4,FALSE),IF(B9=\"Nivå 4\",VLOOKUP(A9,Kartlegging!$B$3:$H$37,5,FALSE),\"\"))))","v":""},null,{"$f":"IF(D9=\"Nivå 1\",VLOOKUP(A9,Kartlegging!$B$3:$H$37,2,FALSE),IF(D9=\"Nivå 2\",VLOOKUP(A9,Kartlegging!$B$3:$H$37,3,FALSE),IF(D9=\"Nivå 3\",VLOOKUP(A9,Kartlegging!$B$3:$H$37,4,FALSE),IF(D9=\"Nivå 4\",VLOOKUP(A9,Kartlegging!$B$3:$H$37,5,FALSE),\"\"))))","v":""}]
["KUNNSKAP OG FERDIGHETER (SKILLS)"]
{"$rows_left_out":12}
{"sheet":"Utvikling del 1","index":7,"n_rows":39,"n_cols":11,"rows_kept":39,"cut":false,"hidden":false,"merged":[]}
["Utvikling"]
[]
[null,"Baseline","2022-06-01","[Dato2]","[Dato3]","[Dato4]","[Dato5]","[Dato6]","[Dato7]","[Dato8]","MÅL"]
["HOLDNINGER OG FORSTÅELSE (MINDSET)"]
["Skoleeiers holdninger og forståelse","Nivå 1",null,null,null,null,null,null,null,null,"Nivå 4"]
["Skolelederes holdninger og forståelse","Nivå 1",null,null,null,null,null,null,null,null,"Nivå 4"]
["Lærernes holdninger og forståelse","Nivå 1",null,null,null,null,null,null,null,null,"Nivå 4"]
["Foresattes holdninger og forståelse","Nivå 1",null,null,null,null,null,null,null,null,"Nivå 4"]
["Elevers holdninger og forståelse","Nivå 1",null,null,null,null,null,null,null,null,"Nivå 4"]
["Etterlevelse av retningslinjer","Nivå 1",null,null,null,null,null,null,null,null,"Nivå 4"]
{"$rows_left_out":30}
{"sheet":"Utvikling del 2-1","index":8,"n_rows":45,"n_cols":8,"rows_kept":45,"cut":false,"hidden":true,"merged":[]}
[]
[]
[1,null,"Baseline","Baseline",{"$f":"'Utvikling del 2'!$B$3","v":"2022-06-01"},{"$f":"'Utvikling del 2'!$B$3","v":"2022-06-01"},"MÅL","Mål"]
[2,"HOLDNINGER OG FORSTÅELSE (MINDSET)"]
[3,"Skoleeiers holdninger og forståelse",{"$f":"'Utvikling del 1'!B5","v":"Nivå 1"},{"$f":"VLOOKUP(C5,$B$41:$C$45,2,FALSE)","v":1},{"$f":"IF(ISBLANK('Utvikling del 2'!$B$3),\"\",HLOOKUP('Utvikling del 2'!$B$3,'Utvikling del 1'!$A$3:$K$39,'Utvikling del 2-1'!A5,FALSE))","v":0},{"$f":"VLOOKUP(E5,$B$41:$C$45,2,FALSE)","v":0},{"$f":"'Utvikling del 1'!K5","v":"Nivå 4"},{"$f":"VLOOKUP(G5,$B$41:$C$45,2,FALSE)","v":4}]
[4,"Skolelederes holdninger og forståelse",{"$f":"'Utvikling del 1'!B6","v":"Nivå 1"},1,{"$f":"IF(ISBLANK('Utvikling del 2'!$B$3),\"\",HLOOKUP('Utvikling del 2'!$B$3,'Utvikling del 1'!$A$3:$K$39,'Utvikling del 2-1'!A6,FALSE))","v":0},0,{"$f":"'Utvikling del 1'!K6","v":"Nivå 4"},4]
[5,"Lærernes holdninger og forståelse",{"$f":"'Utvikling del 1'!B7","v":"Nivå 1"},1,{"$f":"IF(ISBLANK('Utvikling del 2'!$B$3),\"\",HLOOKUP('Utvikling del 2'!$B$3,'Utvikling del 1'!$A$3:$K$39,'Utvikling del 2-1'!A7,FALSE))","v":0},0,{"$f":"'Utvikling del 1'!K7","v":"Nivå 4"},4]
[6,"Foresattes holdninger og forståelse",{"$f":"'Utvikling del 1'!B8","v":"Nivå 1"},1,{"$f":"IF(ISBLANK('Utvikling del 2'!$B$3),\"\",HLOOKUP('Utvikling del 2'!$B$3,'Utvikling del 1'!$A$3:$K$39,'Utvikling del 2-1'!A8,FALSE))","v":0},0,{"$f":"'Utvikling del 1'!K8","v":"Nivå 4"},4]
[7,"Elevers holdninger og forståelse",{"$f":"'Utvikling del 1'!B9","v":"Nivå 1"},1,{"$f":"IF(ISBLANK('Utvikling del 2'!$B$3),\"\",HLOOKUP('Utvikling del 2'!$B$3,'Utvikling del 1'!$A$3:$K$39,'Utvikling del 2-1'!A9,FALSE))","v":0},0,{"$f":"'Utvikling del 1'!K9","v":"Nivå 4"},4]
[8,"Etterlevelse av retningslinjer",{"$f":"'Utvikling del 1'!B10","v":"Nivå 1"},1,{"$f":"IF(ISBLANK('Utvikling del 2'!$B$3),\"\",HLOOKUP('Utvikling del 2'!$B$3,'Utvikling del 1'!$A$3:$K$39,'Utvikling del 2-1'!A10,FALSE))","v":0},0,{"$f":"'Utvikling del 1'!K10","v":"Nivå 4"},4]
{"$rows_left_out":36}
{"sheet":"Utvikling del 2","index":9,"n_rows":3,"n_cols":2,"rows_kept":3,"cut":false,"hidden":false,"merged":[]}
["Utvikling"]
[]
["Siste dato:","2022-06-01"]